Target
Lanosterol synthase
Ligand
BDBM50055644
Substrate
Meas. Tech.
ChEMBL_149029 (CHEMBL759504)
Ki
2500±n/a nM
Citation
 Stach, DZheng, YFPerez, ALOehlschlager, ACAbe, IPrestwich, GDHartman, PG Synthesis and inhibition studies of sulfur-substituted squalene oxide analogues as mechanism-based inhibitors of 2,3-oxidosqualene-lanosterol cyclase. J Med Chem 40:201-9 (1997)  
Target
Name:
Lanosterol synthase
Synonyms:
LSS_RAT Osc
Type:
PROTEIN
Mol. Mass.:
83302.12
Organism:
Rattus norvegicus
Description:
ChEMBL_12083
Residue:
733
  
Inhibitor
Name:
BDBM50055644
Synonyms:
2-Methyl-3-((7E,11E,15Z)-3,7,12,20-tetramethyl-16-vinyl-henicosa-7,11,15,19-tetraenyl)-oxirane | CHEMBL66528
Type:
Small organic molecule
Emp. Form.:
C30H50O
Mol. Mass.:
426.7174
SMILES:
[#6]-[#6](-[#6]-[#6]-[#6]\[#6](-[#6])=[#6]\[#6]-[#6]\[#6]=[#6](/[#6])-[#6]-[#6]\[#6]=[#6](\[#6]-[#6]\[#6]=[#6](/[#6])-[#6])-[#6]=[#6])-[#6]-[#6]-[#6]-1-[#8]-[#6]-1-[#6]
: