Target
Lanosterol synthase
Ligand
BDBM50055645
Substrate
Meas. Tech.
ChEMBL_148907 (CHEMBL756144)
IC50
80000±n/a nM
Citation
 Stach, DZheng, YFPerez, ALOehlschlager, ACAbe, IPrestwich, GDHartman, PG Synthesis and inhibition studies of sulfur-substituted squalene oxide analogues as mechanism-based inhibitors of 2,3-oxidosqualene-lanosterol cyclase. J Med Chem 40:201-9 (1997)  
Target
Name:
Lanosterol synthase
Synonyms:
LSS_RAT Osc
Type:
PROTEIN
Mol. Mass.:
83302.12
Organism:
Rattus norvegicus
Description:
ChEMBL_12083
Residue:
733
  
Inhibitor
Name:
BDBM50055645
Synonyms:
(6E,10E,14E)-2,6,10,15,19-Pentamethyl-21-(3-methyl-oxiranyl)-henicosa-6,10,14-trien-5-one | CHEMBL67465
Type:
Small organic molecule
Emp. Form.:
C29H50O2
Mol. Mass.:
430.7061
SMILES:
CC(C)CCC(=O)C(C)C=CC\C(C)=C\CC\C=C(/C)CCCC(C)CCC1OC1C
: