Target
NT-3 growth factor receptor
Ligand
BDBM50505011
Substrate
Meas. Tech.
ChEMBL_1816967 (CHEMBL4316541)
EC50
170±n/a nM
Citation
 Kargbo, RB Modulation of Tropomyosin Receptor Kinase for the Treatment of Neurotrophin Diseases: Alzheimer's, Huntington's and Parkinson's. ACS Med Chem Lett 10:1590-1591 (2019)  
Target
Name:
NT-3 growth factor receptor
Synonyms:
GP145-TrkC NTRK3_HUMAN Neurotrophic tyrosine kinase receptor type 3 Trk-C Tyrosine kinase receptor C (Trk-C)
Type:
Enzyme
Mol. Mass.:
94428.15
Organism:
Homo sapiens (Human)
Description:
Q16288
Residue:
839
  
Inhibitor
Name:
BDBM50505011
Synonyms:
CHEMBL4529332
Type:
Small organic molecule
Emp. Form.:
C25H23N3O6
Mol. Mass.:
461.4666
SMILES:
COCCOc1cc(ccc1Oc1ccccc1)-n1c(=O)[nH]c(=O)n(-c2ccc(C)cc2)c1=O
: