Target
BDNF/NT-3 growth factors receptor
Ligand
BDBM50505012
Substrate
Meas. Tech.
ChEMBL_1816968 (CHEMBL4316542)
EC50
370±n/a nM
Citation
 Kargbo, RB Modulation of Tropomyosin Receptor Kinase for the Treatment of Neurotrophin Diseases: Alzheimer's, Huntington's and Parkinson's. ACS Med Chem Lett 10:1590-1591 (2019)  
Target
Name:
BDNF/NT-3 growth factors receptor
Synonyms:
GP145-TrkB NTRK2 Neurotrophic tyrosine kinase receptor type 2 Trk-B Tropomyosin-related kinase B Tyrosine kinase receptor B (Trk-B)
Type:
Enzyme
Mol. Mass.:
91996.87
Organism:
Homo sapiens (Human)
Description:
Q16620
Residue:
822
  
Inhibitor
Name:
BDBM50505012
Synonyms:
CHEMBL4472787
Type:
Small organic molecule
Emp. Form.:
C24H21N3O5
Mol. Mass.:
431.4406
SMILES:
CC(C)Oc1cc(ccc1Oc1ccccc1)-n1c(=O)[nH]c(=O)n(-c2ccccc2)c1=O
: