Target
BDNF/NT-3 growth factors receptor
Ligand
BDBM50505008
Substrate
Meas. Tech.
ChEMBL_1816968 (CHEMBL4316542)
EC50
950±n/a nM
Citation
 Kargbo, RB Modulation of Tropomyosin Receptor Kinase for the Treatment of Neurotrophin Diseases: Alzheimer's, Huntington's and Parkinson's. ACS Med Chem Lett 10:1590-1591 (2019)  
Target
Name:
BDNF/NT-3 growth factors receptor
Synonyms:
GP145-TrkB NTRK2 Neurotrophic tyrosine kinase receptor type 2 Trk-B Tropomyosin-related kinase B Tyrosine kinase receptor B (Trk-B)
Type:
Enzyme
Mol. Mass.:
91996.87
Organism:
Homo sapiens (Human)
Description:
Q16620
Residue:
822
  
Inhibitor
Name:
BDBM50505008
Synonyms:
CHEMBL4518577
Type:
Small organic molecule
Emp. Form.:
C22H17N3O5
Mol. Mass.:
403.3875
SMILES:
COc1cccc(c1)-n1c(=O)[nH]c(=O)n(-c2ccc(Oc3ccccc3)cc2)c1=O
: