Target
Potassium voltage-gated channel subfamily H member 2
Ligand
BDBM50505043
Substrate
Meas. Tech.
ChEMBL_1817309 (CHEMBL4316969)
IC50
>40000±n/a nM
Citation
 Shi, CZhang, YWang, TLu, WZhang, SGuo, BChen, QLuo, CZhou, XYang, Y Design, Synthesis, and Biological Evaluation of Novel DNA Gyrase-Inhibiting Spiropyrimidinetriones as Potent Antibiotics for Treatment of Infections Caused by Multidrug-Resistant Gram-Positive Bacteria. J Med Chem 62:2950-2973 (2019)  
Target
Name:
Potassium voltage-gated channel subfamily H member 2
Synonyms:
1,3-beta-glucan synthase component GLS2 ERG Eag-related protein 1 Ether-a-go-go-related gene (HERG) Ether-a-go-go-related gene potassium channel 1 Ether-a-go-go-related gene potassium channel 1 (hERG1) Ether-a-go-go-related protein 1 H-ERG KCNH2 Potassium voltage-gated channel subfamily H member 2 (hERG) Voltage-gated potassium channel subunit Kv11.1 hERG Potassium Channel 1 | putative potassium channel subunit
Type:
Multi-pass membrane protein
Mol. Mass.:
126672.65
Organism:
Homo sapiens (Human)
Description:
Q12809
Residue:
1159
  
Inhibitor
Name:
BDBM50505043
Synonyms:
CHEMBL4460834
Type:
Small organic molecule
Emp. Form.:
C22H22FN5O6S
Mol. Mass.:
503.503
SMILES:
[H][C@]12[C@H](C)O[C@H](C)CN1c1c(CC22C(=O)NC(=O)NC2=O)cc2c(noc2c1F)N1C[C@@H](C)SC1=O
: