Target
Cytochrome P450 2C9
Ligand
BDBM50505041
Substrate
Meas. Tech.
ChEMBL_1817312 (CHEMBL4316972)
IC50
>25000±n/a nM
Citation
 Shi, CZhang, YWang, TLu, WZhang, SGuo, BChen, QLuo, CZhou, XYang, Y Design, Synthesis, and Biological Evaluation of Novel DNA Gyrase-Inhibiting Spiropyrimidinetriones as Potent Antibiotics for Treatment of Infections Caused by Multidrug-Resistant Gram-Positive Bacteria. J Med Chem 62:2950-2973 (2019)  
Target
Name:
Cytochrome P450 2C9
Synonyms:
(R)-limonene 6-monooxygenase CP2C9_HUMAN CYP2C9 Cytochrome P450 2C9 (CYP2C9 ) P-450MP P450 PB-1 | S-mephenytoin 4-hydroxylase
Type:
Enzyme
Mol. Mass.:
55636.33
Organism:
Homo sapiens (Human)
Description:
P11712
Residue:
490
  
Inhibitor
Name:
BDBM50505041
Synonyms:
CHEMBL4533341
Type:
Small organic molecule
Emp. Form.:
C23H22FN5O7
Mol. Mass.:
499.4485
SMILES:
[H][C@]12[C@H](C)O[C@H](C)CN1c1c(CC22C(=O)NC(=O)NC2=O)cc2c(noc2c1F)N1CC2(CC2)OC1=O
: