Target
Cytochrome P450 3A4
Ligand
BDBM50505041
Substrate
Meas. Tech.
ChEMBL_1817273 (CHEMBL4316933)
IC50
>25000±n/a nM
Citation
 Shi, CZhang, YWang, TLu, WZhang, SGuo, BChen, QLuo, CZhou, XYang, Y Design, Synthesis, and Biological Evaluation of Novel DNA Gyrase-Inhibiting Spiropyrimidinetriones as Potent Antibiotics for Treatment of Infections Caused by Multidrug-Resistant Gram-Positive Bacteria. J Med Chem 62:2950-2973 (2019)  
Target
Name:
Cytochrome P450 3A4
Synonyms:
Albendazole monooxygenase CP3A4_HUMAN CYP3A4 CYPIIIA4 Cytochrome P450 3A4 (CYP3A4) Nifedipine oxidase Taurochenodeoxycholate 6-alpha-hydroxylase
Type:
Enzyme
Mol. Mass.:
57349.57
Organism:
Homo sapiens (Human)
Description:
Residue:
503
  
Inhibitor
Name:
BDBM50505041
Synonyms:
CHEMBL4533341
Type:
Small organic molecule
Emp. Form.:
C23H22FN5O7
Mol. Mass.:
499.4485
SMILES:
[H][C@]12[C@H](C)O[C@H](C)CN1c1c(CC22C(=O)NC(=O)NC2=O)cc2c(noc2c1F)N1CC2(CC2)OC1=O
: