Target
Thymidylate synthase
Ligand
BDBM50056520
Substrate
Meas. Tech.
ChEMBL_209646 (CHEMBL811587)
Ki
26.0±n/a nM
Citation
 Jones, TRWebber, SEVarney, MDReddy, MRLewis, KKKathardekar, VMazdiyasni, HDeal, JNguyen, DWelsh, KMWebber, SJohnston, AMatthews, DASmith, WWJanson, CABacquet, RJHowland, EFBooth, CLHerrmann, SMWard, RWWhite, JBartlett, CAMorse, CA Structure-based design of substituted diphenyl sulfones and sulfoxides as lipophilic inhibitors of thymidylate synthase. J Med Chem 40:677-83 (1997)  
Target
Name:
Thymidylate synthase
Synonyms:
TS TYMS Thymidylate synthase (TS) | Thymidylate synthase/GAR transformylase/AICAR transformylase
Type:
Enzyme
Mol. Mass.:
35718.07
Organism:
Homo sapiens (Human)
Description:
Residue:
313
  
Inhibitor
Name:
BDBM50056520
Synonyms:
2-Methyl-6-({prop-2-ynyl-[4-(toluene-2-sulfonyl)-phenyl]-amino}-methyl)-3H-quinazolin-4-one | CHEMBL159364
Type:
Small organic molecule
Emp. Form.:
C26H23N3O3S
Mol. Mass.:
457.544
SMILES:
Cc1nc2ccc(CN(CC#C)c3ccc(cc3)S(=O)(=O)c3ccccc3C)cc2c(=O)[nH]1
: