Target
Thymidylate synthase
Ligand
BDBM50056518
Substrate
Meas. Tech.
ChEMBL_209646 (CHEMBL811587)
Ki
27±n/a nM
Citation
 Jones, TRWebber, SEVarney, MDReddy, MRLewis, KKKathardekar, VMazdiyasni, HDeal, JNguyen, DWelsh, KMWebber, SJohnston, AMatthews, DASmith, WWJanson, CABacquet, RJHowland, EFBooth, CLHerrmann, SMWard, RWWhite, JBartlett, CAMorse, CA Structure-based design of substituted diphenyl sulfones and sulfoxides as lipophilic inhibitors of thymidylate synthase. J Med Chem 40:677-83 (1997)  
Target
Name:
Thymidylate synthase
Synonyms:
TS TYMS Thymidylate synthase (TS) | Thymidylate synthase/GAR transformylase/AICAR transformylase
Type:
Enzyme
Mol. Mass.:
35718.07
Organism:
Homo sapiens (Human)
Description:
Residue:
313
  
Inhibitor
Name:
BDBM50056518
Synonyms:
6-{[(4-Benzenesulfinyl-3-chloro-phenyl)-prop-2-ynyl-amino]-methyl}-2-methyl-3H-quinazolin-4-one | CHEMBL160215
Type:
Small organic molecule
Emp. Form.:
C25H20ClN3O2S
Mol. Mass.:
461.963
SMILES:
Cc1nc2ccc(CN(CC#C)c3ccc(c(Cl)c3)S(=O)c3ccccc3)cc2c(=O)[nH]1
: