Target
Glutamate receptor ionotropic, NMDA 1
Ligand
BDBM50056602
Substrate
Meas. Tech.
ChEMBL_140856 (CHEMBL752487)
IC50
3100±n/a nM
Citation
 Cai, SXKher, SMZhou, ZLIlyin, VEspitia, SATran, MHawkinson, JEWoodward, RMWeber, EKeana, JF Structure-activity relationships of alkyl- and alkoxy-substituted 1,4-dihydroquinoxaline-2,3-diones: potent and systemically active antagonists for the glycine site of the NMDA receptor. J Med Chem 40:730-8 (1997)  
Target
Name:
Glutamate receptor ionotropic, NMDA 1
Synonyms:
Glutamate (NMDA) receptor subunit zeta 1 Glutamate-NMDA-Channel Glutamate-NMDA-Polyamine NMDA Nmdar1 | phencyclidine
Type:
Enzyme Catalytic Domain
Mol. Mass.:
105533.40
Organism:
RAT
Description:
P35439
Residue:
938
  
Inhibitor
Name:
BDBM50056602
Synonyms:
5-Nitro-4,6,7,8-tetrahydro-1H-cyclopenta[g]quinoxaline-2,3-dione | CHEMBL296521
Type:
Small organic molecule
Emp. Form.:
C11H9N3O4
Mol. Mass.:
247.2069
SMILES:
[O-][N+](=O)c1c2CCCc2cc2[n-]c(=[OH+])c(=O)[nH]c12
: