Target
Mitogen-activated protein kinase 11
Ligand
BDBM50331622
Substrate
Meas. Tech.
ChEMBL_1824411 (CHEMBL4324175)
IC50
10.0±n/a nM
Citation
 Röhm, SBerger, BTSchröder, MChaikuad, AWinkel, RHekking, KFWBenningshof, JJCMüller, GTesch, RKudolo, MForster, MLaufer, SKnapp, S Fast Iterative Synthetic Approach toward Identification of Novel Highly Selective p38 MAP Kinase Inhibitors. J Med Chem 62:10757-10782 (2019)  
Target
Name:
Mitogen-activated protein kinase 11
Synonyms:
MAP kinase p38 MK11_HUMAN Mitogen-activated protein kinase p38 beta SAPK2 Stress-activated protein kinase 2 p38-2 p38b
Type:
Enzyme Catalytic Domain
Mol. Mass.:
41351.73
Organism:
Homo sapiens (Human)
Description:
gi_20128774
Residue:
364
  
Inhibitor
Name:
BDBM50331622
Synonyms:
5-amino-N-(5-(cyclopropylcarbamoyl)-2-methylphenyl)-1-phenyl-1H-pyrazole-4-carboxamide | CHEMBL1290404
Type:
Small organic molecule
Emp. Form.:
C21H21N5O2
Mol. Mass.:
375.4237
SMILES:
Cc1ccc(cc1NC(=O)c1cnn(c1N)-c1ccccc1)C(=O)NC1CC1
: