Target
Aldo-keto reductase family 1 member B1
Ligand
BDBM50506667
Substrate
Meas. Tech.
ChEMBL_1826842 (CHEMBL4326716)
Ki
>500±n/a nM
Citation
 Maccari, RDel Corso, APaoli, PAdornato, ILori, GBalestri, FCappiello, MNaß, AWolber, GOttanà, R An investigation on 4-thiazolidinone derivatives as dual inhibitors of aldose reductase and protein tyrosine phosphatase 1B, in the search for potential agents for the treatment of type 2 diabetes mellitus and its complications. Bioorg Med Chem Lett 28:3712-3720 (2018)  
Target
Name:
Aldo-keto reductase family 1 member B1
Synonyms:
AKR1B1 ALDR_HUMAN AR Aldose Reductase (ALR2) Aldose reductase (AR)
Type:
Protein
Mol. Mass.:
35855.50
Organism:
Homo sapiens (Human)
Description:
P15121. 4LAU; 2IKI; 4LB4; 2FZD; 2FZ8; 1US0
Residue:
316
  
Inhibitor
Name:
BDBM50506667
Synonyms:
CHEMBL4448571
Type:
Small organic molecule
Emp. Form.:
C20H17NO5S
Mol. Mass.:
383.418
SMILES:
OC(=O)CN1C(=O)S\C(=C/c2cccc(OCCc3ccccc3)c2)C1=O
: