Target
cGMP-specific 3',5'-cyclic phosphodiesterase
Ligand
BDBM14363
Substrate
Meas. Tech.
ChEMBL_155185 (CHEMBL761832)
IC50
500±n/a nM
Citation
 Ahn, HSBercovici, ABoykow, GBronnenkant, AChackalamannil, SChow, JCleven, RCook, JCzarniecki, MDomalski, CFawzi, AGreen, MGündes, AHo, GLaudicina, MLindo, NMa, KManna, MMcKittrick, BMirzai, BNechuta, TNeustadt, BPuchalski, CPula, KZhang, H Potent tetracyclic guanine inhibitors of PDE1 and PDE5 cyclic guanosine monophosphate phosphodiesterases with oral antihypertensive activity. J Med Chem 40:2196-210 (1997)  
Target
Name:
cGMP-specific 3',5'-cyclic phosphodiesterase
Synonyms:
PDE5 PDE5A_BOVIN | Phosphodiesterase 5A
Type:
PROTEIN
Mol. Mass.:
98615.45
Organism:
Bos taurus
Description:
ChEMBL_155186
Residue:
865
  
Inhibitor
Name:
BDBM14363
Synonyms:
3-(2-propoxyphenyl)-2,4,7,8,9-pentazabicyclo[4.3.0]nona-1,3,6-trien-5-one Tocris-0947 | Zaprinast
Type:
Small organic molecule
Emp. Form.:
C13H13N5O2
Mol. Mass.:
271.2746
SMILES:
CCCOc1ccccc1-c1nc2nn[nH]c2c(=O)[nH]1
: