Target
Mitogen-activated protein kinase 10
Ligand
BDBM50506719
Substrate
Meas. Tech.
ChEMBL_1827111 (CHEMBL4326985)
Kd
2900±n/a nM
Citation
 Schepetkin, IAKhlebnikov, AIPotapov, ASKovrizhina, ARMatveevskaya, VVBelyanin, MLAtochin, DNZanoza, SOGaidarzhy, NMLyakhov, SAKirpotina, LNQuinn, MT Synthesis, biological evaluation, and molecular modeling of 11H-indeno[1,2-b]quinoxalin-11-one derivatives and tryptanthrin-6-oxime as c-Jun N-terminal kinase inhibitors. Eur J Med Chem 161:179-191 (2019)  
Target
Name:
Mitogen-activated protein kinase 10
Synonyms:
JNK3 MAP kinase p49 3F12 MK10_HUMAN Mitogen-activated protein kinase 10 (Stress-activated protein kinase JNK3) (c-Jun N-terminal kinase 3) (MAP kinase p49 3F12) PRKM10 Stress-activated protein kinase JNK3 | c-Jun N-terminal kinase 3 (JNK3)
Type:
Enzyme
Mol. Mass.:
52586.89
Organism:
Homo sapiens (Human)
Description:
Residue:
464
  
Inhibitor
Name:
BDBM50506719
Synonyms:
CHEMBL4457644
Type:
Small organic molecule
Emp. Form.:
C14H7ClN4O
Mol. Mass.:
282.685
SMILES:
O\N=C1\c2ccccc2-c2nc3ncc(Cl)cc3nc12
: