Target
Mitogen-activated protein kinase kinase kinase 8
Ligand
BDBM3175
Substrate
Meas. Tech.
ChEMBL_1828503 (CHEMBL4328377)
IC50
9950±n/a nM
Citation
 Narayan, SRamisetti, SJaiswal, ASLaw, BKSingh-Pillay, ASingh, PAmin, SSharma, AK ASR352, A potent anticancer agent: Synthesis, preliminary SAR, and biological activities against colorectal cancer bulk, 5-fluorouracil/oxaliplatin resistant and stem cells. Eur J Med Chem 161:456-467 (2019)  
Target
Name:
Mitogen-activated protein kinase kinase kinase 8
Synonyms:
C-COT COT proto-oncogene serine/threonine-protein kinase ESTF MAP3K8 Tumor Progression Loci-2 Kinase (COT) | Tumor progression locus 2
Type:
Serine/threonine-protein kinase
Mol. Mass.:
52916.89
Organism:
Homo sapiens (Human)
Description:
P41279
Residue:
467
  
Inhibitor
Name:
BDBM3175
Synonyms:
3-[1-[3-(Amidinothio)propyl]-3-indolyl]-4-(1-methyl-3-indolyl)-1H-pyrrole-2,5-dione Methanesulfonate Bisindolylmaleimide 11b CHEMBL6291 Ro 31-8220 [(3-{3-[4-(1-methyl-1H-indol-3-yl)-2,5-dioxo-2,5-dihydro-1H-pyrrol-3-yl]-1H-indol-1-yl}propyl)sulfanyl]methanimidamide
Type:
Small organic molecule
Emp. Form.:
C25H23N5O2S
Mol. Mass.:
457.547
SMILES:
Cn1cc(C2=C(C(=O)NC2=O)c2cn(CCCSC(N)=N)c3ccccc23)c2ccccc12
: