Target
Falcipain 2
Ligand
BDBM50059577
Substrate
Meas. Tech.
ChEMBL_69691 (CHEMBL682027)
IC50
30000±n/a nM
Citation
 Domínguez, JNLópez, SCharris, JIarruso, LLobo, GSemenov, AOlson, JERosenthal, PJ Synthesis and antimalarial effects of phenothiazine inhibitors of a Plasmodium falciparum cysteine protease. J Med Chem 40:2726-32 (1997)  
Target
Name:
Falcipain 2
Synonyms:
Cysteine protease falcipain-2 Falcipain-2
Type:
Enzyme
Mol. Mass.:
55912.60
Organism:
Plasmodium falciparum
Description:
Recombinant falcipain-2.
Residue:
484
  
Inhibitor
Name:
BDBM50059577
Synonyms:
7-Chloro-2-(2,4-dichloro-phenyl)-5,5-dioxo-2,3,5,10-tetrahydro-1H-5lambda*6*-phenothiazin-4-one | CHEMBL93846
Type:
Small organic molecule
Emp. Form.:
C18H12Cl3NO3S
Mol. Mass.:
428.717
SMILES:
Clc1ccc(C2CC(=O)C3C(C2)=Nc2ccc(Cl)cc2S3(=O)=O)c(Cl)c1
: