Target
Falcipain 2
Ligand
BDBM50059566
Substrate
Meas. Tech.
ChEMBL_69691 (CHEMBL682027)
IC50
5000±n/a nM
Citation
 Domínguez, JNLópez, SCharris, JIarruso, LLobo, GSemenov, AOlson, JERosenthal, PJ Synthesis and antimalarial effects of phenothiazine inhibitors of a Plasmodium falciparum cysteine protease. J Med Chem 40:2726-32 (1997)  
Target
Name:
Falcipain 2
Synonyms:
Cysteine protease falcipain-2 Falcipain-2
Type:
Enzyme
Mol. Mass.:
55912.60
Organism:
Plasmodium falciparum
Description:
Recombinant falcipain-2.
Residue:
484
  
Inhibitor
Name:
BDBM50059566
Synonyms:
7-Chloro-2,2-dimethyl-5,5-dioxo-2,3,5,10-tetrahydro-1H-5lambda*6*-phenothiazin-4-one | CHEMBL329629
Type:
Small organic molecule
Emp. Form.:
C14H14ClNO3S
Mol. Mass.:
311.784
SMILES:
CC1(C)CC(=O)C2C(C1)=Nc1ccc(Cl)cc1S2(=O)=O
: