Target
Falcipain 2
Ligand
BDBM50059576
Substrate
Meas. Tech.
ChEMBL_69691 (CHEMBL682027)
IC50
10000±n/a nM
Citation
 Domínguez, JNLópez, SCharris, JIarruso, LLobo, GSemenov, AOlson, JERosenthal, PJ Synthesis and antimalarial effects of phenothiazine inhibitors of a Plasmodium falciparum cysteine protease. J Med Chem 40:2726-32 (1997)  
Target
Name:
Falcipain 2
Synonyms:
Cysteine protease falcipain-2 Falcipain-2
Type:
Enzyme
Mol. Mass.:
55912.60
Organism:
Plasmodium falciparum
Description:
Recombinant falcipain-2.
Residue:
484
  
Inhibitor
Name:
BDBM50059576
Synonyms:
2-(2,4-Dichloro-phenyl)-7-fluoro-2,3-dihydro-1H,10H-phenothiazin-4-one | CHEMBL92738
Type:
Small organic molecule
Emp. Form.:
C18H12Cl2FNOS
Mol. Mass.:
380.263
SMILES:
Fc1ccc2N=C3CC(CC(=O)C3Sc2c1)c1ccc(Cl)cc1Cl
: