Target
Falcipain 2
Ligand
BDBM50059560
Substrate
Meas. Tech.
ChEMBL_69691 (CHEMBL682027)
IC50
10000±n/a nM
Citation
 Domínguez, JNLópez, SCharris, JIarruso, LLobo, GSemenov, AOlson, JERosenthal, PJ Synthesis and antimalarial effects of phenothiazine inhibitors of a Plasmodium falciparum cysteine protease. J Med Chem 40:2726-32 (1997)  
Target
Name:
Falcipain 2
Synonyms:
Cysteine protease falcipain-2 Falcipain-2
Type:
Enzyme
Mol. Mass.:
55912.60
Organism:
Plasmodium falciparum
Description:
Recombinant falcipain-2.
Residue:
484
  
Inhibitor
Name:
BDBM50059560
Synonyms:
7-Chloro-2-(2,3-dimethoxy-phenyl)-2,3-dihydro-1H,10H-phenothiazin-4-one | CHEMBL420812
Type:
Small organic molecule
Emp. Form.:
C20H18ClNO3S
Mol. Mass.:
387.88
SMILES:
COc1cccc(C2CC(=O)C3Sc4cc(Cl)ccc4N=C3C2)c1OC
: