Target
Neutrophil elastase
Ligand
BDBM50279770
Substrate
Meas. Tech.
ChEMBL_63999 (CHEMBL673108)
Ki
120±n/a nM
Citation
 Regan, JMcGarry, DBruno, JGreen, DNewman, JHsu, CYKline, JBarton, JTravis, JChoi, YMVolz, FPauls, HHarrison, RZilberstein, ABen-Sasson, SAChang, M Anionic- and lipophilic-mediated surface binding inhibitors of human leukocyte elastase. J Med Chem 40:3408-22 (1997)  
Target
Name:
Neutrophil elastase
Synonyms:
Bone marrow serine protease Coagulation factor X ELANE Elastase HLE Leukocyte elastase Medullasin Neutrophil elastase (HNE) PMN elastase Trypsin
Type:
Enzyme
Mol. Mass.:
28532.38
Organism:
Homo sapiens (Human)
Description:
P08246
Residue:
267
  
Inhibitor
Name:
BDBM50279770
Synonyms:
2-{4-benzyloxy-5-[5-benzyloxy-4-(5-benzyloxy-4-{5-benzyloxy-4-[5-benzyloxy-2-carboxymethoxy-4-(2-carboxymethoxy-5-hydroxybenzyl)benzyl]-2-carboxymethoxybenzyl}-2-carboxymethoxybenzyl)-2-carboxymethoxybenzyl]-2-hydroxymethylphenoxy}acetic acid.H2O | CHEMBL267968
Type:
Small organic molecule
Emp. Form.:
C89H80O25
Mol. Mass.:
1549.5725
SMILES:
OCc1cc(OCc2ccccc2)c(Cc2cc(OCc3ccccc3)c(Cc3cc(OCc4ccccc4)c(Cc4cc(OCc5ccccc5)c(Cc5cc(OCc6ccccc6)c(Cc6cc(O)ccc6OCC(O)=O)cc5OCC(O)=O)cc4OCC(O)=O)cc3OCC(O)=O)cc2OCC(O)=O)cc1OCC(O)=O
: