Target
Histone deacetylase 1
Ligand
BDBM50507688
Substrate
Meas. Tech.
ChEMBL_1831281 (CHEMBL4331289)
IC50
11160±n/a nM
Citation
 Yu, CWHung, PYYang, HTHo, YHLai, HYCheng, YSChern, JW Quinazolin-2,4-dione-Based Hydroxamic Acids as Selective Histone Deacetylase-6 Inhibitors for Treatment of Non-Small Cell Lung Cancer. J Med Chem 62:857-874 (2019)  
Target
Name:
Histone deacetylase 1
Synonyms:
Cereblon/Histone deacetylase 1 HDAC1 Histone deacetylase 1 (HDAC1) RPD3L1
Type:
Enzyme
Mol. Mass.:
55090.27
Organism:
Homo sapiens (Human)
Description:
Q13547
Residue:
482
  
Inhibitor
Name:
BDBM50507688
Synonyms:
CHEMBL4550214 | US11535598, Compound 5
Type:
Small organic molecule
Emp. Form.:
C24H21N3O4
Mol. Mass.:
415.4412
SMILES:
ONC(=O)c1ccc(Cn2c3ccccc3c(=O)n(CCc3ccccc3)c2=O)cc1
: