Target
Histone deacetylase 11
Ligand
BDBM50507688
Substrate
Meas. Tech.
ChEMBL_1831284 (CHEMBL4331292)
IC50
13900±n/a nM
Citation
 Yu, CWHung, PYYang, HTHo, YHLai, HYCheng, YSChern, JW Quinazolin-2,4-dione-Based Hydroxamic Acids as Selective Histone Deacetylase-6 Inhibitors for Treatment of Non-Small Cell Lung Cancer. J Med Chem 62:857-874 (2019)  
Target
Name:
Histone deacetylase 11
Synonyms:
HD11 HDAC11 | Human HDAC11
Type:
Chromatin regulator; hydrolase; repressor
Mol. Mass.:
39187.66
Organism:
Homo sapiens (Human)
Description:
Q96DB2
Residue:
347
  
Inhibitor
Name:
BDBM50507688
Synonyms:
CHEMBL4550214 | US11535598, Compound 5
Type:
Small organic molecule
Emp. Form.:
C24H21N3O4
Mol. Mass.:
415.4412
SMILES:
ONC(=O)c1ccc(Cn2c3ccccc3c(=O)n(CCc3ccccc3)c2=O)cc1
: