Target
Dihydrofolate reductase
Ligand
BDBM50029763
Substrate
Meas. Tech.
ChEMBL_52851 (CHEMBL664375)
IC50
42±n/a nM
Citation
 Rosowsky, APapoulis, ATQueener, SF 2,4-Diaminothieno[2,3-d]pyrimidine lipophilic antifolates as inhibitors of Pneumocystis carinii and Toxoplasma gondii dihydrofolate reductase. J Med Chem 40:3694-9 (1997)  
Target
Name:
Dihydrofolate reductase
Synonyms:
DYR_PNECA Dihydrofolate reductase Tetrahydrofolate dehydrogenase
Type:
Enzyme
Mol. Mass.:
23891.29
Organism:
Pneumocystis carinii
Description:
Residue:
206
  
Inhibitor
Name:
BDBM50029763
Synonyms:
5-(3,5-Diethoxy-4-pyrrol-1-yl-benzyl)-pyrimidine-2,4-diamine Epiroprim | TCMDC-137295
Type:
Small organic molecule
Emp. Form.:
C19H23N5O2
Mol. Mass.:
353.4182
SMILES:
CCOc1cc(Cc2cnc(N)nc2N)cc(OCC)c1-n1cccc1
: