Target
KiSS-1 receptor
Ligand
BDBM50442961
Substrate
Meas. Tech.
ChEMBL_1832255 (CHEMBL4332263)
EC50
0.170±n/a nM
Citation
 Nishizawa, NAsami, TNishibori, KTakatsu, YSuzuki, AUshio, KMatsumoto, SIShimizu, YYamaguchi, MKusaka, MMatsui, HOhtaki, TKitada, C A new class of pentapeptide KISS1 receptor agonists with hypothalamic-pituitary-gonadal axis activation. Bioorg Med Chem Lett 29:654-658 (2019)  
Target
Name:
KiSS-1 receptor
Synonyms:
Gpr54 Kiss1r
Type:
PROTEIN
Mol. Mass.:
42915.37
Organism:
Rattus norvegicus
Description:
ChEMBL_1448383
Residue:
396
  
Inhibitor
Name:
BDBM50442961
Synonyms:
CHEMBL3086284
Type:
Small organic molecule
Emp. Form.:
C56H76N16O12
Mol. Mass.:
1165.3026
SMILES:
CNC(N)=NCCC[C@H](NC(=O)[C@H](CC(C)C)NC(=O)NNC(=O)[C@H](Cc1ccccc1)NC(=O)[C@H](CO)NC(=O)[C@H](CC(N)=O)NC(=O)[C@@H](Cc1ccncc1)NC(=O)[C@H](N)Cc1ccc(O)cc1)C(=O)N[C@@H](Cc1ccccc1)C(N)=O
: