Target
Alpha-1A adrenergic receptor
Ligand
BDBM50033111
Substrate
Meas. Tech.
ChEMBL_33607 (CHEMBL652814)
Ki
2±n/a nM
Citation
 Meyer, MDAltenbach, RJBasha, FZCarroll, WADrizin, IElmore, SWEhrlich, PPLebold, SATietje, KSippy, KBWendt, MDPlata, DJPlagge, FBuckner, SABrune, MEHancock, AAKerwin, JF Synthesis and pharmacological characterization of 3-[2-((3aR,9bR)-cis-6-methoxy-2,3,3a,4,5,9b-hexahydro-1H-benz[e] isoindol-2-yl)ethyl]pyrido-[3',4':4,5]thieno[3,2-d]pyrimidine-2,4 (1H,3H)-dione (A-131701): a uroselective alpha 1A adrenoceptor antagonist for the symptomatic treatment of benign pr J Med Chem 40:3141-3 (1997)  
Target
Name:
Alpha-1A adrenergic receptor
Synonyms:
ADA1A_HUMAN ADRA1C Alpha 1A-adrenoceptor Alpha adrenergic receptor 1a Alpha-adrenergic receptor 1c adrenergic Alpha1 | adrenergic Alpha1C
Type:
Cell-surface receptors
Mol. Mass.:
51511.67
Organism:
Homo sapiens (Human)
Description:
P35348
Residue:
466
  
Inhibitor
Name:
BDBM50033111
Synonyms:
1-(4-Amino-6,7-dimethoxy-2-quinazolinyl)-4-((tetrahydro-2-furanyl)carbonyl)piperazine CHEMBL611 Terazosine
Type:
Small organic molecule
Emp. Form.:
C19H25N5O4
Mol. Mass.:
387.4329
SMILES:
COc1cc2nc(nc(N)c2cc1OC)N1CCN(CC1)C(=O)C1CCCO1
: