Target
Bromodomain-containing protein 4
Ligand
BDBM249277
Substrate
Meas. Tech.
ChEMBL_1832480 (CHEMBL4332488)
Ki
16±n/a nM
Citation
 Sperandio, DAktoudianakis, VBabaoglu, KChen, XElbel, KChin, GCorkey, BDu, JJiang, BKobayashi, TMackman, RMartinez, RYang, HZablocki, JKusam, SJordan, KWebb, HBates, JGLad, LMish, MNiedziela-Majka, AMetobo, SSapre, AHung, MJin, DFung, WKan, EEisenberg, GLarson, NNewby, ZERLansdon, ETay, CNeve, RMShevick, SLBreckenridge, DG Structure-guided discovery of a novel, potent, and orally bioavailable 3,5-dimethylisoxazole aryl-benzimidazole BET bromodomain inhibitor. Bioorg Med Chem 27:457-469 (2019)  
Target
Name:
Bromodomain-containing protein 4
Synonyms:
BRD4 Bromodomain-containing protein 4 (BRD4) Protein HUNK1
Type:
Protein
Mol. Mass.:
152264.84
Organism:
Homo sapiens (Human)
Description:
O60885
Residue:
1362
  
Inhibitor
Name:
BDBM249277
Synonyms:
US10017501, Compound 1020-18 | US9458145, 1020-18
Type:
Small organic molecule
Emp. Form.:
C25H22N4O
Mol. Mass.:
394.4684
SMILES:
Cc1noc(C)c1-c1cc(-c2c(C)ccc3ncccc23)c2[nH]c(nc2c1)C1CC1
: