Target
Cannabinoid receptor 1
Ligand
BDBM50061116
Substrate
Meas. Tech.
ChEMBL_46805 (CHEMBL659692)
Ki
33±n/a nM
Citation
 Rhee, MHVogel, ZBarg, JBayewitch, MLevy, RHanus, LBreuer, AMechoulam, R Cannabinol derivatives: binding to cannabinoid receptors and inhibition of adenylylcyclase. J Med Chem 40:3228-33 (1997)  
Target
Name:
Cannabinoid receptor 1
Synonyms:
Brain-type cannabinoid receptor CB-R CNR1_RAT Cannabinoid receptor Cnr1 | Skr6
Type:
G Protein-Coupled Receptor (GPCR)
Mol. Mass.:
52856.55
Organism:
Rattus norvegicus (rat)
Description:
P20272
Residue:
473
  
Inhibitor
Name:
BDBM50061116
Synonyms:
3-(1',1'-dimethylheptyl)-1-hydroxy-9-methyl-6H-benzo[c]-chromene-6-one CHEMBL113230
Type:
Small organic molecule
Emp. Form.:
C23H28O3
Mol. Mass.:
352.4666
SMILES:
CCCCCCC(C)(C)c1cc(O)c2c(c1)oc(=O)c1ccc(C)cc21
: