Target
Cannabinoid receptor 2
Ligand
BDBM50061113
Substrate
Meas. Tech.
ChEMBL_46987 (CHEMBL658956)
Ki
1.5±n/a nM
Citation
 Rhee, MHVogel, ZBarg, JBayewitch, MLevy, RHanus, LBreuer, AMechoulam, R Cannabinol derivatives: binding to cannabinoid receptors and inhibition of adenylylcyclase. J Med Chem 40:3228-33 (1997)  
Target
Name:
Cannabinoid receptor 2
Synonyms:
CANNABINOID CB2 CB2 CB2B CNR2_HUMAN Cannabinoid CB2 receptor Cannabinoid receptor 2 (CB2R) | hCB2
Type:
G Protein-Coupled Receptor (GPCR)
Mol. Mass.:
39690.94
Organism:
Homo sapiens (Human)
Description:
P34972
Residue:
360
  
Inhibitor
Name:
BDBM50061113
Synonyms:
3-(1',1'-dimethylheptyl)-6,6,9-trimethyl-6H-benzo[c]chromene-1-ol CHEMBL109393
Type:
Small organic molecule
Emp. Form.:
C25H34O2
Mol. Mass.:
366.5363
SMILES:
CCCCCCC(C)(C)c1cc(O)c-2c(OC(C)(C)c3ccc(C)cc-23)c1
: