Target
Cannabinoid receptor 1
Ligand
BDBM50061112
Substrate
Meas. Tech.
ChEMBL_46805 (CHEMBL659692)
Ki
38±n/a nM
Citation
 Rhee, MHVogel, ZBarg, JBayewitch, MLevy, RHanus, LBreuer, AMechoulam, R Cannabinol derivatives: binding to cannabinoid receptors and inhibition of adenylylcyclase. J Med Chem 40:3228-33 (1997)  
Target
Name:
Cannabinoid receptor 1
Synonyms:
Brain-type cannabinoid receptor CB-R CNR1_RAT Cannabinoid receptor Cnr1 | Skr6
Type:
G Protein-Coupled Receptor (GPCR)
Mol. Mass.:
52856.55
Organism:
Rattus norvegicus (rat)
Description:
P20272
Residue:
473
  
Inhibitor
Name:
BDBM50061112
Synonyms:
9-Hydroxymethyl-6,6-dimethyl-3-pentyl-6H-benzo[c]chromen-1-ol | CHEMBL109972
Type:
Small organic molecule
Emp. Form.:
C21H26O3
Mol. Mass.:
326.4293
SMILES:
CCCCCc1cc(O)c-2c(OC(C)(C)c3ccc(CO)cc-23)c1
: