Target
Cannabinoid receptor 2
Ligand
BDBM50061112
Substrate
Meas. Tech.
ChEMBL_46987 (CHEMBL658956)
Ki
26.6±n/a nM
Citation
 Rhee, MHVogel, ZBarg, JBayewitch, MLevy, RHanus, LBreuer, AMechoulam, R Cannabinol derivatives: binding to cannabinoid receptors and inhibition of adenylylcyclase. J Med Chem 40:3228-33 (1997)  
Target
Name:
Cannabinoid receptor 2
Synonyms:
CANNABINOID CB2 CB2 CB2B CNR2_HUMAN Cannabinoid CB2 receptor Cannabinoid receptor 2 (CB2R) | hCB2
Type:
G Protein-Coupled Receptor (GPCR)
Mol. Mass.:
39690.94
Organism:
Homo sapiens (Human)
Description:
P34972
Residue:
360
  
Inhibitor
Name:
BDBM50061112
Synonyms:
9-Hydroxymethyl-6,6-dimethyl-3-pentyl-6H-benzo[c]chromen-1-ol | CHEMBL109972
Type:
Small organic molecule
Emp. Form.:
C21H26O3
Mol. Mass.:
326.4293
SMILES:
CCCCCc1cc(O)c-2c(OC(C)(C)c3ccc(CO)cc-23)c1
: