Target
Cannabinoid receptor 1
Ligand
BDBM50061118
Substrate
Meas. Tech.
ChEMBL_46805 (CHEMBL659692)
Ki
32.3±n/a nM
Citation
 Rhee, MHVogel, ZBarg, JBayewitch, MLevy, RHanus, LBreuer, AMechoulam, R Cannabinol derivatives: binding to cannabinoid receptors and inhibition of adenylylcyclase. J Med Chem 40:3228-33 (1997)  
Target
Name:
Cannabinoid receptor 1
Synonyms:
Brain-type cannabinoid receptor CB-R CNR1_RAT Cannabinoid receptor Cnr1 | Skr6
Type:
G Protein-Coupled Receptor (GPCR)
Mol. Mass.:
52856.55
Organism:
Rattus norvegicus (rat)
Description:
P20272
Residue:
473
  
Inhibitor
Name:
BDBM50061118
Synonyms:
(R)-3-(1,1-Dimethyl-heptyl)-1-hydroxy-6,6-dimethyl-6a,7,10,10a-tetrahydro-6H-benzo[c]chromene-9-carboxylic acid CHEMBL320408
Type:
Small organic molecule
Emp. Form.:
C25H36O4
Mol. Mass.:
400.5509
SMILES:
CCCCCCC(C)(C)c1cc(O)c2C3CC(=CC[C@H]3C(C)(C)Oc2c1)C(O)=O
: