Target
Cannabinoid receptor 1
Ligand
BDBM50061114
Substrate
Meas. Tech.
ChEMBL_46635 (CHEMBL658891)
Ki
6.1±n/a nM
Citation
 Rhee, MHVogel, ZBarg, JBayewitch, MLevy, RHanus, LBreuer, AMechoulam, R Cannabinol derivatives: binding to cannabinoid receptors and inhibition of adenylylcyclase. J Med Chem 40:3228-33 (1997)  
Target
Name:
Cannabinoid receptor 1
Synonyms:
Brain-type cannabinoid receptor CB-R CNR1_RAT Cannabinoid receptor Cnr1 | Skr6
Type:
G Protein-Coupled Receptor (GPCR)
Mol. Mass.:
52856.55
Organism:
Rattus norvegicus (rat)
Description:
P20272
Residue:
473
  
Inhibitor
Name:
BDBM50061114
Synonyms:
3-(1,1-Dimethyl-heptyl)-1-hydroxy-6,6-dimethyl-6H-benzo[c]chromene-9-carboxylic acid | CHEMBL111340
Type:
Small organic molecule
Emp. Form.:
C25H32O4
Mol. Mass.:
396.5192
SMILES:
CCCCCCC(C)(C)c1cc(O)c-2c(OC(C)(C)c3ccc(cc-23)C(O)=O)c1
: