Target
Cannabinoid receptor 2
Ligand
BDBM50061110
Substrate
Meas. Tech.
ChEMBL_46987 (CHEMBL658956)
Ki
17.3±n/a nM
Citation
 Rhee, MHVogel, ZBarg, JBayewitch, MLevy, RHanus, LBreuer, AMechoulam, R Cannabinol derivatives: binding to cannabinoid receptors and inhibition of adenylylcyclase. J Med Chem 40:3228-33 (1997)  
Target
Name:
Cannabinoid receptor 2
Synonyms:
CANNABINOID CB2 CB2 CB2B CNR2_HUMAN Cannabinoid CB2 receptor Cannabinoid receptor 2 (CB2R) | hCB2
Type:
G Protein-Coupled Receptor (GPCR)
Mol. Mass.:
39690.94
Organism:
Homo sapiens (Human)
Description:
P34972
Residue:
360
  
Inhibitor
Name:
BDBM50061110
Synonyms:
1-Acetoxy-3-(1,1-dimethyl-heptyl)-6,6-dimethyl-6H-benzo[c]chromene-9-carboxylic acid | CHEMBL111702
Type:
Small organic molecule
Emp. Form.:
C27H34O5
Mol. Mass.:
438.5559
SMILES:
CCCCCCC(C)(C)c1cc(OC(C)=O)c-2c(OC(C)(C)c3ccc(cc-23)C(O)=O)c1
: