Target
Cannabinoid receptor 2
Ligand
BDBM50061116
Substrate
Meas. Tech.
ChEMBL_46987 (CHEMBL658956)
Ki
17.3±n/a nM
Citation
 Rhee, MHVogel, ZBarg, JBayewitch, MLevy, RHanus, LBreuer, AMechoulam, R Cannabinol derivatives: binding to cannabinoid receptors and inhibition of adenylylcyclase. J Med Chem 40:3228-33 (1997)  
Target
Name:
Cannabinoid receptor 2
Synonyms:
CANNABINOID CB2 CB2 CB2B CNR2_HUMAN Cannabinoid CB2 receptor Cannabinoid receptor 2 (CB2R) | hCB2
Type:
G Protein-Coupled Receptor (GPCR)
Mol. Mass.:
39690.94
Organism:
Homo sapiens (Human)
Description:
P34972
Residue:
360
  
Inhibitor
Name:
BDBM50061116
Synonyms:
3-(1',1'-dimethylheptyl)-1-hydroxy-9-methyl-6H-benzo[c]-chromene-6-one CHEMBL113230
Type:
Small organic molecule
Emp. Form.:
C23H28O3
Mol. Mass.:
352.4666
SMILES:
CCCCCCC(C)(C)c1cc(O)c2c(c1)oc(=O)c1ccc(C)cc21
: