Target
Cannabinoid receptor 1
Ligand
BDBM50061113
Substrate
Meas. Tech.
ChEMBL_46805 (CHEMBL659692)
Ki
2±n/a nM
Citation
 Rhee, MHVogel, ZBarg, JBayewitch, MLevy, RHanus, LBreuer, AMechoulam, R Cannabinol derivatives: binding to cannabinoid receptors and inhibition of adenylylcyclase. J Med Chem 40:3228-33 (1997)  
Target
Name:
Cannabinoid receptor 1
Synonyms:
Brain-type cannabinoid receptor CB-R CNR1_RAT Cannabinoid receptor Cnr1 | Skr6
Type:
G Protein-Coupled Receptor (GPCR)
Mol. Mass.:
52856.55
Organism:
Rattus norvegicus (rat)
Description:
P20272
Residue:
473
  
Inhibitor
Name:
BDBM50061113
Synonyms:
3-(1',1'-dimethylheptyl)-6,6,9-trimethyl-6H-benzo[c]chromene-1-ol CHEMBL109393
Type:
Small organic molecule
Emp. Form.:
C25H34O2
Mol. Mass.:
366.5363
SMILES:
CCCCCCC(C)(C)c1cc(O)c-2c(OC(C)(C)c3ccc(C)cc-23)c1
: