Target
5-hydroxytryptamine receptor 1B
Ligand
BDBM50454686
Substrate
Meas. Tech.
ChEMBL_1595 (CHEMBL617005)
EC50
>1000±n/a nM
Citation
 Jorand-Lebrun, CPauwels, PJPalmier, CMoret, CChopin, PPerez, MMarien, MHalazy, S 5-HT1B receptor antagonist properties of novel arylpiperazide derivatives of 1-naphthylpiperazine. J Med Chem 40:3974-8 (1998)  
Target
Name:
5-hydroxytryptamine receptor 1B
Synonyms:
5-HT-1B 5-HT1B 5HT1B_HUMAN HTR1DB Serotonin (5-HT) receptor Serotonin Receptor 1B
Type:
G Protein-Coupled Receptor (GPCR)
Mol. Mass.:
43579.17
Organism:
Homo sapiens (Human)
Description:
Receptor binding assays were performed using human clone stably expressed in CHO cells
Residue:
390
  
Inhibitor
Name:
BDBM50454686
Synonyms:
CHEMBL2112662
Type:
Small organic molecule
Emp. Form.:
C29H36N4O2
Mol. Mass.:
472.6217
SMILES:
CN1CCN(CC1)c1cccc2ccc(OCC(=O)N3CCN(Cc4ccccc4C)CC3)cc12
: