Target
5-hydroxytryptamine receptor 1A
Ligand
BDBM50454686
Substrate
Meas. Tech.
ChEMBL_954 (CHEMBL616133)
Ki
23±n/a nM
Citation
 Jorand-Lebrun, CPauwels, PJPalmier, CMoret, CChopin, PPerez, MMarien, MHalazy, S 5-HT1B receptor antagonist properties of novel arylpiperazide derivatives of 1-naphthylpiperazine. J Med Chem 40:3974-8 (1998)  
Target
Name:
5-hydroxytryptamine receptor 1A
Synonyms:
5-HT-1A 5-hydroxytryptamine receptor 1A (5-HT-1A) ADRB2RL1 Dopamine D2 receptor and serotonin 1a receptor HTR1A | Serotonin receptor 1A
Type:
Mol. Mass.:
46122.49
Organism:
Homo sapiens (Human)
Description:
Residue:
422
  
Inhibitor
Name:
BDBM50454686
Synonyms:
CHEMBL2112662
Type:
Small organic molecule
Emp. Form.:
C29H36N4O2
Mol. Mass.:
472.6217
SMILES:
CN1CCN(CC1)c1cccc2ccc(OCC(=O)N3CCN(Cc4ccccc4C)CC3)cc12
: