Target
5-hydroxytryptamine receptor 1B
Ligand
BDBM50061296
Substrate
Meas. Tech.
ChEMBL_1358 (CHEMBL616431)
Ki
0.440000±n/a nM
Citation
 Jorand-Lebrun, CPauwels, PJPalmier, CMoret, CChopin, PPerez, MMarien, MHalazy, S 5-HT1B receptor antagonist properties of novel arylpiperazide derivatives of 1-naphthylpiperazine. J Med Chem 40:3974-8 (1998)  
Target
Name:
5-hydroxytryptamine receptor 1B
Synonyms:
5-HT-1B 5-HT1B 5HT1B_HUMAN HTR1DB Serotonin (5-HT) receptor Serotonin Receptor 1B
Type:
G Protein-Coupled Receptor (GPCR)
Mol. Mass.:
43579.17
Organism:
Homo sapiens (Human)
Description:
Receptor binding assays were performed using human clone stably expressed in CHO cells
Residue:
390
  
Inhibitor
Name:
BDBM50061296
Synonyms:
1-[4-(2,3-Dimethoxy-phenyl)-piperazin-1-yl]-2-[8-(4-methyl-piperazin-1-yl)-naphthalen-2-yloxy]-ethanone | CHEMBL338015
Type:
Small organic molecule
Emp. Form.:
C29H36N4O4
Mol. Mass.:
504.6205
SMILES:
COc1cccc(N2CCN(CC2)C(=O)COc2ccc3cccc(N4CCN(C)CC4)c3c2)c1OC
: