Target
5-hydroxytryptamine receptor 1D
Ligand
BDBM50454685
Substrate
Meas. Tech.
ChEMBL_1729 (CHEMBL616934)
Ki
0.510000±n/a nM
Citation
 Jorand-Lebrun, CPauwels, PJPalmier, CMoret, CChopin, PPerez, MMarien, MHalazy, S 5-HT1B receptor antagonist properties of novel arylpiperazide derivatives of 1-naphthylpiperazine. J Med Chem 40:3974-8 (1998)  
Target
Name:
5-hydroxytryptamine receptor 1D
Synonyms:
5-HT-1D 5-HT1D 5HT1D_HUMAN HTR1DA Serotonin (5-HT) receptor | Serotonin Receptor 1D
Type:
G Protein-Coupled Receptor (GPCR)
Mol. Mass.:
41920.63
Organism:
Homo sapiens (Human)
Description:
Receptor binding assays were performed using human clone stably expressed in CHO cells.
Residue:
377
  
Inhibitor
Name:
BDBM50454685
Synonyms:
CHEMBL2112660
Type:
Small organic molecule
Emp. Form.:
C28H31N5O2
Mol. Mass.:
469.578
SMILES:
CN1CCN(CC1)c1cccc2ccc(OCC(=O)N3CCN(CC3)c3ccccc3C#N)cc12
: