Target
Reverse transcriptase/RNaseH
Ligand
BDBM50004126
Substrate
Meas. Tech.
ChEMBL_197283 (CHEMBL804270)
EC50
100±n/a nM
Citation
 Kireev, DBChrétien, JRGrierson, DSMonneret, C A 3D QSAR study of a series of HEPT analogues: the influence of conformational mobility on HIV-1 reverse transcriptase inhibition. J Med Chem 40:4257-64 (1998)  
Target
Name:
Reverse transcriptase/RNaseH
Synonyms:
HIV-1 Reverse Transcriptase RNase H Reverse transcriptase/RNaseH
Type:
PROTEIN
Mol. Mass.:
65229.15
Organism:
Human immunodeficiency virus 1
Description:
ChEMBL_1473730
Residue:
566
  
Inhibitor
Name:
BDBM50004126
Synonyms:
5-Cyclopropyl-1-ethoxymethyl-6-phenylsulfanyl-1H-pyrimidine-2,4-dione | CHEMBL39093
Type:
Small organic molecule
Emp. Form.:
C16H18N2O3S
Mol. Mass.:
318.391
SMILES:
CCOCn1c(Sc2ccccc2)c(C2CC2)c(=O)[nH]c1=O
: