Target
Sodium-dependent dopamine transporter
Ligand
BDBM50061878
Substrate
Meas. Tech.
ChEMBL_62498 (CHEMBL677555)
Ki
86±n/a nM
Citation
 Agoston, GEWu, JHIzenwasser, SGeorge, CKatz, JKline, RHNewman, AH Novel N-substituted 3 alpha-[bis(4'-fluorophenyl)methoxy]tropane analogues: selective ligands for the dopamine transporter. J Med Chem 40:4329-39 (1998)  
Target
Name:
Sodium-dependent dopamine transporter
Synonyms:
DA transporter SC6A3_RAT Sodium-dependent dopamine transporter | Sodium-dependent dopamine transporter (DAT)
Type:
Multi-pass membrane protein
Mol. Mass.:
68749.45
Organism:
Rattus norvegicus (rat)
Description:
P23977
Residue:
619
  
Inhibitor
Name:
BDBM50061878
Synonyms:
(E)-1-{3-[Bis-(4-fluoro-phenyl)-methoxy]-8-aza-bicyclo[3.2.1]oct-8-yl}-3-phenyl-propenone | CHEMBL3084927
Type:
Small organic molecule
Emp. Form.:
C29H27F2NO2
Mol. Mass.:
459.527
SMILES:
[H][C@]12CC[C@]([H])(C[C@H](C1)OC(c1ccc(F)cc1)c1ccc(F)cc1)N2C(=O)\C=C\c1ccccc1
: