Target
Sodium-dependent dopamine transporter
Ligand
BDBM50061880
Substrate
Meas. Tech.
ChEMBL_62498 (CHEMBL677555)
Ki
45±n/a nM
Citation
 Agoston, GEWu, JHIzenwasser, SGeorge, CKatz, JKline, RHNewman, AH Novel N-substituted 3 alpha-[bis(4'-fluorophenyl)methoxy]tropane analogues: selective ligands for the dopamine transporter. J Med Chem 40:4329-39 (1998)  
Target
Name:
Sodium-dependent dopamine transporter
Synonyms:
DA transporter SC6A3_RAT Sodium-dependent dopamine transporter | Sodium-dependent dopamine transporter (DAT)
Type:
Multi-pass membrane protein
Mol. Mass.:
68749.45
Organism:
Rattus norvegicus (rat)
Description:
P23977
Residue:
619
  
Inhibitor
Name:
BDBM50061880
Synonyms:
1-(2-{3-[Bis-(4-fluoro-phenyl)-methoxy]-8-aza-bicyclo[3.2.1]oct-8-yl}-ethyl)-1H-indole | CHEMBL3084928
Type:
Small organic molecule
Emp. Form.:
C30H30F2N2O
Mol. Mass.:
472.5688
SMILES:
[H][C@]12CC[C@]([H])(C[C@@H](C1)OC(c1ccc(F)cc1)c1ccc(F)cc1)N2CCn1ccc2ccccc12
: