Target
Sodium-dependent dopamine transporter
Ligand
BDBM50061879
Substrate
Meas. Tech.
ChEMBL_62498 (CHEMBL677555)
Ki
82±n/a nM
Citation
 Agoston, GEWu, JHIzenwasser, SGeorge, CKatz, JKline, RHNewman, AH Novel N-substituted 3 alpha-[bis(4'-fluorophenyl)methoxy]tropane analogues: selective ligands for the dopamine transporter. J Med Chem 40:4329-39 (1998)  
Target
Name:
Sodium-dependent dopamine transporter
Synonyms:
DA transporter SC6A3_RAT Sodium-dependent dopamine transporter | Sodium-dependent dopamine transporter (DAT)
Type:
Multi-pass membrane protein
Mol. Mass.:
68749.45
Organism:
Rattus norvegicus (rat)
Description:
P23977
Residue:
619
  
Inhibitor
Name:
BDBM50061879
Synonyms:
8-Benzyl-3-[2,2-bis-(4-fluoro-phenyl)-ethyl]-8-aza-bicyclo[3.2.1]octane CHEMBL12375
Type:
Small organic molecule
Emp. Form.:
C27H27F2NO
Mol. Mass.:
419.5062
SMILES:
Fc1ccc(cc1)C(OC1CC2CCC(C1)N2Cc1ccccc1)c1ccc(F)cc1
: