Target
Muscarinic acetylcholine receptor M1
Ligand
BDBM86701
Substrate
Meas. Tech.
ChEMBL_138953 (CHEMBL742765)
Ki
9±n/a nM
Citation
 Agoston, GEWu, JHIzenwasser, SGeorge, CKatz, JKline, RHNewman, AH Novel N-substituted 3 alpha-[bis(4'-fluorophenyl)methoxy]tropane analogues: selective ligands for the dopamine transporter. J Med Chem 40:4329-39 (1998)  
Target
Name:
Muscarinic acetylcholine receptor M1
Synonyms:
ACM1_RAT Chrm-1 cholinergic receptor, muscarinic 1
Type:
Enzyme Catalytic Domain
Mol. Mass.:
51390.46
Organism:
RAT
Description:
P08482
Residue:
460
  
Inhibitor
Name:
BDBM86701
Synonyms:
3-(bis(4-fluorophenyl)methoxy)-8-methyl-8-aza-bicyclo[3.2.1]octane 3-[Bis-(4-fluoro-phenyl)-methoxy]-8-methyl-8-azonia-bicyclo[3.2.1]octane CHEMBL317757 | CHEMBL543113
Type:
Small organic molecule
Emp. Form.:
C21H23F2NO
Mol. Mass.:
343.4102
SMILES:
CN1C2CCC1CC(C2)OC(c1ccc(F)cc1)c1ccc(F)cc1
: