Target
Dihydrofolate reductase
Ligand
BDBM50508928
Substrate
Meas. Tech.
ChEMBL_1835740 (CHEMBL4335873)
IC50
49.7±n/a nM
Citation
 Patel, TSBhatt, JDDixit, RBChudasama, CJPatel, BDDixit, BC Green synthesis, biological evaluation, molecular docking studies and 3D-QSAR analysis of novel phenylalanine linked quinazoline-4(3H)-one-sulphonamide hybrid entities distorting the malarial reductase activity in folate pathway. Bioorg Med Chem 27:3574-3586 (2019)  
Target
Name:
Dihydrofolate reductase
Synonyms:
DHFR Dihydrofolate reductase | Dihydrofolate reductase (DHFR)
Type:
Enzyme
Mol. Mass.:
21603.71
Organism:
Bos taurus (Cattle)
Description:
P00376
Residue:
187
  
Inhibitor
Name:
BDBM50508928
Synonyms:
CHEMBL4436660
Type:
Small organic molecule
Emp. Form.:
C31H26FN5O4S
Mol. Mass.:
583.633
SMILES:
CC(=O)Nc1ccc(cc1)S(=O)(=O)NC(Cc1ccccc1)c1nc2ccccc2c(=O)n1\N=C\c1cccc(F)c1
: