Target
Acyl-protein thioesterase 1
Ligand
BDBM50050513
Substrate
Meas. Tech.
ChEMBL_1836616 (CHEMBL4336749)
IC50
66±n/a nM
Citation
 Plescia, JDe Cesco, SPatrascu, MBKurian, JDi Trani, JDufresne, CWahba, ASJanmamode, NMittermaier, AKMoitessier, N Integrated Synthetic, Biophysical, and Computational Investigations of Covalent Inhibitors of Prolyl Oligopeptidase and Fibroblast Activation Protein ?. J Med Chem 62:7874-7884 (2019)  
Target
Name:
Acyl-protein thioesterase 1
Synonyms:
Acyl-protein thioesterase 1/2 LYPA1_RAT Lysosomal phospholipase A1
Type:
PROTEIN
Mol. Mass.:
24708.49
Organism:
Rattus norvegicus
Description:
ChEMBL_12731
Residue:
230
  
Inhibitor
Name:
BDBM50050513
Synonyms:
(R)-1-((S)-2-amino-3-methylbutanoyl)pyrrolidin-2-ylboronic acid (S)-2-Amino-3-methyl-2-boronic acid-1-pyrrolidin-1-yl-butan-1-one CHEMBL67279 Pyrrolidine derivative US11504364, Compound Val-boroPro US11707539, Compound 2054
Type:
Small organic molecule
Emp. Form.:
C9H19BN2O3
Mol. Mass.:
214.07
SMILES:
CC(C)[C@H](N)C(=O)N1CCC[C@H]1B(O)O
: