Target
Muscarinic acetylcholine receptor M1
Ligand
BDBM50062594
Substrate
Meas. Tech.
ChEMBL_138689 (CHEMBL747656)
IC50
201±n/a nM
Citation
 Ward, JSMerritt, LCalligaro, DOBymaster, FPShannon, HEMitch, CHWhitesitt, CBrunsting, DSheardown, MJOlesen, PHSwedberg, MDJeppesen, LSauerberg, P 1,2,5-Thiadiazole analogues of aceclidine as potent m1 muscarinic agonists. J Med Chem 41:379-92 (1998)  
Target
Name:
Muscarinic acetylcholine receptor M1
Synonyms:
ACM1_RAT Chrm-1 cholinergic receptor, muscarinic 1
Type:
Enzyme Catalytic Domain
Mol. Mass.:
51390.46
Organism:
RAT
Description:
P08482
Residue:
460
  
Inhibitor
Name:
BDBM50062594
Synonyms:
3-(4-Methoxy-[1,2,5]thiadiazol-3-yloxy)-1-aza-bicyclo[2.2.2]octane | CHEMBL409280
Type:
Small organic molecule
Emp. Form.:
C10H15N3O2S
Mol. Mass.:
241.31
SMILES:
COc1nsnc1OC1CN2CCC1CC2
: