Target
Polyunsaturated fatty acid 5-lipoxygenase
Ligand
BDBM50062676
Substrate
Meas. Tech.
ChEMBL_4158 (CHEMBL619225)
IC50
300±n/a nM
Citation
 Hopper, ATWitiak, DTZiemniak, J Design, synthesis, and biological evaluation of conformationally constrained aci-reductone mimics of arachidonic acid. J Med Chem 41:420-7 (1998)  
Target
Name:
Polyunsaturated fatty acid 5-lipoxygenase
Synonyms:
Alox5 LOX5_RAT
Type:
PROTEIN
Mol. Mass.:
78082.31
Organism:
Rattus norvegicus
Description:
ChEMBL_1432947
Residue:
673
  
Inhibitor
Name:
BDBM50062676
Synonyms:
3,4-Dihydroxy-5-[4-(2-phenylsulfanylmethyl-phenyl)-but-3-ynyl]-5H-furan-2-one | CHEMBL135986
Type:
Small organic molecule
Emp. Form.:
C21H18O4S
Mol. Mass.:
366.43
SMILES:
Oc1oc(CCC#Cc2ccccc2CSc2ccccc2)c(O)c1O
: