Target
Acetylcholinesterase
Ligand
BDBM50509708
Substrate
Meas. Tech.
ChEMBL_1839126 (CHEMBL4339341)
Ki
253±n/a nM
Citation
 AlFadly, EDElzahhar, PATramarin, AElkazaz, SShaltout, HAbu-Serie, MMJanockova, JSoukup, OGhareeb, DAEl-Yazbi, AFRafeh, RWBakkar, NZKobeissy, FIriepa, IMoraleda, ISaudi, MNSBartolini, MBelal, ASF Tackling neuroinflammation and cholinergic deficit in Alzheimer's disease: Multi-target inhibitors of cholinesterases, cyclooxygenase-2 and 15-lipoxygenase. Eur J Med Chem 167:161-186 (2019)  
Target
Name:
Acetylcholinesterase
Synonyms:
ACES_HUMAN Acetylcholinesterase (AChE) | Acetylcholinesterase (human AChE)
Type:
Enzyme
Mol. Mass.:
67792.70
Organism:
Homo sapiens (Human)
Description:
P22303
Residue:
614
  
Inhibitor
Name:
BDBM50509708
Synonyms:
CHEMBL4458648
Type:
Small organic molecule
Emp. Form.:
C21H22N4S
Mol. Mass.:
362.491
SMILES:
S=C(NCc1ccccc1)NNc1c2CCCCc2nc2ccccc12
: